{"text_format":"2","workbook":"xlsx","n_sheets":3,"sheets":["決勝トーナメント","チャレンジトーナメント","master"],"not_rendered":{"charts":0,"images":0,"macros":0,"external_links":0,"defined_names":0,"comments":0,"pivot_tables":0},"unopened":[],"bounds":{"document_bytes":16777216,"sheet_cells":100000,"run_cost":"one","rows_first":2000,"rows_last":500,"rows_between":2000,"halvings":0,"cell_chars":16384,"cell_head_chars":4096},"cells_cut":0,"cells_raw":0,"read":"whole","date_system":"1900"}

{"sheet":"決勝トーナメント","index":0,"n_rows":55,"n_cols":22,"rows_kept":55,"cut":false,"hidden":false,"merged":[[51,4,52,4],[53,4,54,4],[3,18,4,18],[5,18,6,18],[7,18,8,18],[9,18,10,18],[11,18,12,18],[0,1,0,21],[35,18,36,18],[37,18,38,18],[39,18,40,18],[41,18,42,18],[43,18,44,18],[45,18,46,18],[47,18,48,18],[49,18,50,18],[39,4,40,4],[41,4,42,4],[43,4,44,4],[45,4,46,4],[47,4,48,4],[49,4,50,4],[15,18,16,18],[17,18,18,18],[19,18,20,18],[21,18,22,18],[23,18,24,18],[25,18,26,18],[27,18,28,18],[29,18,30,18],[53,18,54,18],[51,18,52,18],[33,18,34,18],[51,19,52,19],[51,20,52,20],[51,21,52,21],[53,19,54,19],[53,20,54,20],[53,21,54,21],[3,4,4,4],[5,4,6,4],[7,4,8,4],[9,4,10,4],[11,4,12,4],[13,4,14,4],[15,4,16,4],[17,4,18,4],[19,4,20,4],[21,4,22,4],[23,4,24,4],[25,4,26,4],[27,4,28,4],[29,4,30,4],[31,4,32,4],[33,4,34,4],[13,18,14,18],[35,4,36,4],[37,4,38,4],[45,19,46,19],[45,20,46,20],[45,21,46,21],[47,19,48,19],[47,20,48,20],[47,21,48,21],[49,19,50,19],[49,20,50,20],[49,21,50,21],[39,19,40,19],[39,20,40,20],[39,21,40,21],[41,19,42,19],[41,20,42,20],[41,21,42,21],[43,19,44,19],[43,20,44,20],[43,21,44,21],[33,19,34,19],[33,20,34,20],[33,21,34,21],[35,19,36,19],[35,20,36,20],[35,21,36,21],[37,19,38,19],[37,20,38,20],[37,21,38,21],[27,19,28,19],[27,20,28,20],[27,21,28,21],[28,11,29,11],[29,19,30,19],[29,20,30,20],[29,21,30,21],[31,19,32,19],[31,20,32,20],[31,21,32,21],[31,18,32,18],[21,19,22,19],[21,20,22,20],[21,21,22,21],[23,19,24,19],[23,20,24,20],[23,21,24,21],[25,19,26,19],[25,20,26,20],[25,21,26,21],[15,19,16,19],[15,20,16,20],[15,21,16,21],[17,19,18,19],[17,20,18,20],[17,21,18,21],[19,19,20,19],[19,20,20,20],[19,21,20,21],[9,19,10,19],[9,20,10,20],[9,21,10,21],[11,19,12,19],[11,20,12,20],[11,21,12,21],[13,19,14,19],[13,20,14,20],[13,21,14,21],[3,19,4,19],[3,20,4,20],[3,21,4,21],[5,19,6,19],[5,20,6,20],[5,21,6,21],[7,19,8,19],[7,20,8,20],[7,21,8,21],[39,3,40,3],[41,3,42,3],[43,3,44,3],[45,3,46,3],[47,3,48,3],[49,3,50,3],[51,3,52,3],[53,3,54,3],[21,3,22,3],[23,3,24,3],[25,3,26,3],[27,3,28,3],[29,3,30,3],[31,3,32,3],[33,3,34,3],[35,3,36,3],[37,3,38,3],[3,3,4,3],[5,3,6,3],[7,3,8,3],[9,3,10,3],[11,3,12,3],[13,3,14,3],[15,3,16,3],[17,3,18,3],[19,3,20,3],[13,2,14,2],[39,2,40,2],[27,2,28,2],[19,2,20,2],[17,2,18,2],[45,2,46,2],[37,2,38,2],[31,2,32,2],[37,1,38,1],[33,2,34,2],[39,1,40,1],[35,1,36,1],[41,1,42,1],[21,2,22,2],[15,1,16,1],[51,2,52,2],[29,2,30,2],[43,2,44,2],[47,2,48,2],[41,2,42,2],[19,1,20,1],[29,1,30,1],[25,1,26,1],[17,1,18,1],[23,1,24,1],[31,1,32,1],[47,1,48,1],[49,1,50,1],[3,1,4,1],[7,1,8,1],[9,1,10,1],[7,2,8,2],[5,2,6,2],[9,2,10,2],[53,1,54,1],[45,1,46,1],[51,1,52,1],[25,2,26,2],[23,2,24,2],[3,2,4,2],[5,1,6,1],[11,2,12,2],[49,2,50,2],[35,2,36,2],[15,2,16,2],[43,1,44,1],[53,2,54,2],[33,1,34,1],[11,1,12,1],[13,1,14,1],[27,1,28,1],[21,1,22,1]]}
[null,"第１６回　スーパーリ－グ決勝トーナメント表"]
[]
[]
[null,1,{"$f":"IF(INDEX(master!$A$2:$C$53,MATCH(E4,master!$A$2:$A$53,0),3)=0,\"\",INDEX(master!$A$2:$C$53,MATCH(E4,master!$A$2:$A$53,0),3))","v":"本村クラブ"},{"$f":"INDEX(master!$A$2:$C$53,MATCH(E4,master!$A$2:$A$53,0),2)","v":"A1位"},1,{"$nulls":11},2,null,3,{"$f":"INDEX(master!$A$2:$C$53,MATCH(S4,master!$A$2:$A$53,0),2)","v":"C1位"},{"$f":"IF(INDEX(master!$A$2:$C$53,MATCH(S4,master!$A$2:$A$53,0),3)=0,\"\",INDEX(master!$A$2:$C$53,MATCH(S4,master!$A$2:$A$53,0),3))","v":"茗荷谷クラブ"},27]
[{"$nulls":7},2,{"$nulls":7},6]
[null,2,{"$f":"IF(INDEX(master!$A$2:$C$53,MATCH(E6,master!$A$2:$A$53,0),3)=0,\"\",INDEX(master!$A$2:$C$53,MATCH(E6,master!$A$2:$A$53,0),3))","v":"新宿ドリーム"},{"$f":"INDEX(master!$A$2:$C$53,MATCH(E6,master!$A$2:$A$53,0),2)","v":"G3位"},33,5,{"$nulls":11},4,35,{"$f":"INDEX(master!$A$2:$C$53,MATCH(S6,master!$A$2:$A$53,0),2)","v":"I3位"},{"$f":"IF(INDEX(master!$A$2:$C$53,MATCH(S6,master!$A$2:$A$53,0),3)=0,\"\",INDEX(master!$A$2:$C$53,MATCH(S6,master!$A$2:$A$53,0),3))","v":"元加賀"},28]
[]
[null,3,{"$f":"IF(INDEX(master!$A$2:$C$53,MATCH(E8,master!$A$2:$A$53,0),3)=0,\"\",INDEX(master!$A$2:$C$53,MATCH(E8,master!$A$2:$A$53,0),3))","v":"扇ターキーズ"},{"$f":"INDEX(master!$A$2:$C$53,MATCH(E8,master!$A$2:$A$53,0),2)","v":"F3位"},32,{"$nulls":11},0,null,30,{"$f":"INDEX(master!$A$2:$C$53,MATCH(S8,master!$A$2:$A$53,0),2)","v":"D3位"},{"$f":"IF(INDEX(master!$A$2:$C$53,MATCH(S8,master!$A$2:$A$53,0),3)=0,\"\",INDEX(master!$A$2:$C$53,MATCH(S8,master!$A$2:$A$53,0),3))","v":"大向ベアーズ"},29]
[{"$nulls":5},6,null,null,2,{"$nulls":5},1,null,null,2]
[null,4,{"$f":"IF(INDEX(master!$A$2:$C$53,MATCH(E10,master!$A$2:$A$53,0),3)=0,\"\",INDEX(master!$A$2:$C$53,MATCH(E10,master!$A$2:$A$53,0),3))","v":"東雲メッツ"},{"$f":"INDEX(master!$A$2:$C$53,MATCH(E10,master!$A$2:$A$53,0),2)","v":"D2位"},17,3,{"$nulls":11},14,19,{"$f":"INDEX(master!$A$2:$C$53,MATCH(S10,master!$A$2:$A$53,0),2)","v":"F2位"},{"$f":"IF(INDEX(master!$A$2:$C$53,MATCH(S10,master!$A$2:$A$53,0),3)=0,\"\",INDEX(master!$A$2:$C$53,MATCH(S10,master!$A$2:$A$53,0),3))","v":"葛飾アニマルズ"},30]
[{"$nulls":6},3,{"$nulls":9},8]
[null,5,{"$f":"IF(INDEX(master!$A$2:$C$53,MATCH(E12,master!$A$2:$A$53,0),3)=0,\"\",INDEX(master!$A$2:$C$53,MATCH(E12,master!$A$2:$A$53,0),3))","v":"品川レインボーズ"},{"$f":"INDEX(master!$A$2:$C$53,MATCH(E12,master!$A$2:$A$53,0),2)","v":"I4位"},48,{"$nulls":13},46,{"$f":"INDEX(master!$A$2:$C$53,MATCH(S12,master!$A$2:$A$53,0),2)","v":"G4位"},{"$f":"IF(INDEX(master!$A$2:$C$53,MATCH(S12,master!$A$2:$A$53,0),3)=0,\"\",INDEX(master!$A$2:$C$53,MATCH(S12,master!$A$2:$A$53,0),3))","v":"晴海アポローズ"},31]
[{"$nulls":5},6,{"$nulls":11},1]
[null,6,{"$f":"IF(INDEX(master!$A$2:$C$53,MATCH(E14,master!$A$2:$A$53,0),3)=0,\"\",INDEX(master!$A$2:$C$53,MATCH(E14,master!$A$2:$A$53,0),3))","v":"西伊興若潮ジュニア"},{"$f":"INDEX(master!$A$2:$C$53,MATCH(E14,master!$A$2:$A$53,0),2)","v":"J4位"},49,11,null,3,{"$nulls":7},5,null,0,52,{"$f":"INDEX(master!$A$2:$C$53,MATCH(S14,master!$A$2:$A$53,0),2)","v":"M4位"},{"$f":"IF(INDEX(master!$A$2:$C$53,MATCH(S14,master!$A$2:$A$53,0),3)=0,\"\",INDEX(master!$A$2:$C$53,MATCH(S14,master!$A$2:$A$53,0),3))","v":"舎人スポーツ少年団"},32]
[]
[null,7,{"$f":"IF(INDEX(master!$A$2:$C$53,MATCH(E16,master!$A$2:$A$53,0),3)=0,\"\",INDEX(master!$A$2:$C$53,MATCH(E16,master!$A$2:$A$53,0),3))","v":"越中島ブレーブス"},{"$f":"INDEX(master!$A$2:$C$53,MATCH(E16,master!$A$2:$A$53,0),2)","v":"C2位"},16,null,5,{"$nulls":9},1,null,14,{"$f":"INDEX(master!$A$2:$C$53,MATCH(S16,master!$A$2:$A$53,0),2)","v":"A2位"},{"$f":"IF(INDEX(master!$A$2:$C$53,MATCH(S16,master!$A$2:$A$53,0),3)=0,\"\",INDEX(master!$A$2:$C$53,MATCH(S16,master!$A$2:$A$53,0),3))","v":"大島中央"},33]
[{"$nulls":5},2,null,null,null,4,null,null,null,5,null,null,null,5]
[null,8,{"$f":"IF(INDEX(master!$A$2:$C$53,MATCH(E18,master!$A$2:$A$53,0),3)=0,\"\",INDEX(master!$A$2:$C$53,MATCH(E18,master!$A$2:$A$53,0),3))","v":"高島エイト"},{"$f":"INDEX(master!$A$2:$C$53,MATCH(E18,master!$A$2:$A$53,0),2)","v":"I1位"},9,null,12,{"$nulls":9},4,null,11,{"$f":"INDEX(master!$A$2:$C$53,MATCH(S18,master!$A$2:$A$53,0),2)","v":"K1位"},{"$f":"IF(INDEX(master!$A$2:$C$53,MATCH(S18,master!$A$2:$A$53,0),3)=0,\"\",INDEX(master!$A$2:$C$53,MATCH(S18,master!$A$2:$A$53,0),3))","v":"用賀ベアーズ"},34]
[{"$nulls":7},2,{"$nulls":7},7]
[null,9,{"$f":"IF(INDEX(master!$A$2:$C$53,MATCH(E20,master!$A$2:$A$53,0),3)=0,\"\",INDEX(master!$A$2:$C$53,MATCH(E20,master!$A$2:$A$53,0),3))","v":"御殿山ファイターズ"},{"$f":"INDEX(master!$A$2:$C$53,MATCH(E20,master!$A$2:$A$53,0),2)","v":"B4位"},41,2,{"$nulls":11},1,43,{"$f":"INDEX(master!$A$2:$C$53,MATCH(S20,master!$A$2:$A$53,0),2)","v":"D4位"},{"$f":"IF(INDEX(master!$A$2:$C$53,MATCH(S20,master!$A$2:$A$53,0),3)=0,\"\",INDEX(master!$A$2:$C$53,MATCH(S20,master!$A$2:$A$53,0),3))","v":"ジュニアヤンガース"},35]
[]
[null,10,{"$f":"IF(INDEX(master!$A$2:$C$53,MATCH(E22,master!$A$2:$A$53,0),3)=0,\"\",INDEX(master!$A$2:$C$53,MATCH(E22,master!$A$2:$A$53,0),3))","v":"北原少年野球クラブ"},{"$f":"INDEX(master!$A$2:$C$53,MATCH(E22,master!$A$2:$A$53,0),2)","v":"K2位"},24,null,2,{"$nulls":9},1,null,22,{"$f":"INDEX(master!$A$2:$C$53,MATCH(S22,master!$A$2:$A$53,0),2)","v":"I2位"},{"$f":"IF(INDEX(master!$A$2:$C$53,MATCH(S22,master!$A$2:$A$53,0),3)=0,\"\",INDEX(master!$A$2:$C$53,MATCH(S22,master!$A$2:$A$53,0),3))","v":"高輪クラブ"},36]
[{"$nulls":5},8,{"$nulls":11},13]
[null,11,{"$f":"IF(INDEX(master!$A$2:$C$53,MATCH(E24,master!$A$2:$A$53,0),3)=0,\"\",INDEX(master!$A$2:$C$53,MATCH(E24,master!$A$2:$A$53,0),3))","v":"不動パイレーツ"},{"$f":"INDEX(master!$A$2:$C$53,MATCH(E24,master!$A$2:$A$53,0),2)","v":"L2位"},25,4,null,null,3,{"$nulls":5},3,null,null,8,27,{"$f":"INDEX(master!$A$2:$C$53,MATCH(S24,master!$A$2:$A$53,0),2)","v":"A3位"},{"$f":"IF(INDEX(master!$A$2:$C$53,MATCH(S24,master!$A$2:$A$53,0),3)=0,\"\",INDEX(master!$A$2:$C$53,MATCH(S24,master!$A$2:$A$53,0),3))","v":"ブラザースクラブ"},37]
[{"$nulls":6},3,{"$nulls":9},0]
[null,12,{"$f":"IF(INDEX(master!$A$2:$C$53,MATCH(E26,master!$A$2:$A$53,0),3)=0,\"\",INDEX(master!$A$2:$C$53,MATCH(E26,master!$A$2:$A$53,0),3))","v":"新田ファイヤーズ"},{"$f":"INDEX(master!$A$2:$C$53,MATCH(E26,master!$A$2:$A$53,0),2)","v":"A4位"},40,{"$nulls":13},39,{"$f":"INDEX(master!$A$2:$C$53,MATCH(S26,master!$A$2:$A$53,0),2)","v":"M3位"},{"$f":"IF(INDEX(master!$A$2:$C$53,MATCH(S26,master!$A$2:$A$53,0),3)=0,\"\",INDEX(master!$A$2:$C$53,MATCH(S26,master!$A$2:$A$53,0),3))","v":"品川Bレーシング"},38]
[{"$nulls":5},0,{"$nulls":11},2]
[null,13,{"$f":"IF(INDEX(master!$A$2:$C$53,MATCH(E28,master!$A$2:$A$53,0),3)=0,\"\",INDEX(master!$A$2:$C$53,MATCH(E28,master!$A$2:$A$53,0),3))","v":"淀四ライオンズ"},{"$f":"INDEX(master!$A$2:$C$53,MATCH(E28,master!$A$2:$A$53,0),2)","v":"H1位"},8,null,null,0,null,null,null,"│",null,null,null,8,null,null,6,{"$f":"INDEX(master!$A$2:$C$53,MATCH(S28,master!$A$2:$A$53,0),2)","v":"F1位"},{"$f":"IF(INDEX(master!$A$2:$C$53,MATCH(S28,master!$A$2:$A$53,0),3)=0,\"\",INDEX(master!$A$2:$C$53,MATCH(S28,master!$A$2:$A$53,0),3))","v":"山野Ｒイーグルス"},39]
[{"$nulls":6},4,null,null,null,6,"Final",5,null,null,null,11]
[null,14,{"$f":"IF(INDEX(master!$A$2:$C$53,MATCH(E30,master!$A$2:$A$53,0),3)=0,\"\",INDEX(master!$A$2:$C$53,MATCH(E30,master!$A$2:$A$53,0),3))","v":"七北クラブ"},{"$f":"INDEX(master!$A$2:$C$53,MATCH(E30,master!$A$2:$A$53,0),2)","v":"E1位"},5,null,0,{"$nulls":9},7,null,10,{"$f":"INDEX(master!$A$2:$C$53,MATCH(S30,master!$A$2:$A$53,0),2)","v":"J1位"},{"$f":"IF(INDEX(master!$A$2:$C$53,MATCH(S30,master!$A$2:$A$53,0),3)=0,\"\",INDEX(master!$A$2:$C$53,MATCH(S30,master!$A$2:$A$53,0),3))","v":"船橋フェニックス"},40]
[{"$nulls":7},2,{"$nulls":7},"2(5)"]
[null,15,{"$f":"IF(INDEX(master!$A$2:$C$53,MATCH(E32,master!$A$2:$A$53,0),3)=0,\"\",INDEX(master!$A$2:$C$53,MATCH(E32,master!$A$2:$A$53,0),3))","v":"しらさぎ"},{"$f":"INDEX(master!$A$2:$C$53,MATCH(E32,master!$A$2:$A$53,0),2)","v":"K3位"},37,14,{"$nulls":11},3,38,{"$f":"INDEX(master!$A$2:$C$53,MATCH(S32,master!$A$2:$A$53,0),2)","v":"L3位"},{"$f":"IF(INDEX(master!$A$2:$C$53,MATCH(S32,master!$A$2:$A$53,0),3)=0,\"\",INDEX(master!$A$2:$C$53,MATCH(S32,master!$A$2:$A$53,0),3))","v":"旗の台クラブ"},41]
[]
[null,16,{"$f":"IF(INDEX(master!$A$2:$C$53,MATCH(E34,master!$A$2:$A$53,0),3)=0,\"\",INDEX(master!$A$2:$C$53,MATCH(E34,master!$A$2:$A$53,0),3))","v":"目黒ペガサス"},{"$f":"INDEX(master!$A$2:$C$53,MATCH(E34,master!$A$2:$A$53,0),2)","v":"B3位"},28,null,10,{"$nulls":9},4,null,26,{"$f":"INDEX(master!$A$2:$C$53,MATCH(S34,master!$A$2:$A$53,0),2)","v":"M2位"},{"$f":"IF(INDEX(master!$A$2:$C$53,MATCH(S34,master!$A$2:$A$53,0),3)=0,\"\",INDEX(master!$A$2:$C$53,MATCH(S34,master!$A$2:$A$53,0),3))","v":"サンジュニア"},42]
[{"$nulls":5},0,null,null,5,{"$nulls":5},3,null,null,2]
[null,17,{"$f":"IF(INDEX(master!$A$2:$C$53,MATCH(E36,master!$A$2:$A$53,0),3)=0,\"\",INDEX(master!$A$2:$C$53,MATCH(E36,master!$A$2:$A$53,0),3))","v":"池雪ジュニアS"},{"$f":"INDEX(master!$A$2:$C$53,MATCH(E36,master!$A$2:$A$53,0),2)","v":"H2位"},21,1,{"$nulls":11},12,23,{"$f":"INDEX(master!$A$2:$C$53,MATCH(S36,master!$A$2:$A$53,0),2)","v":"J2位"},{"$f":"IF(INDEX(master!$A$2:$C$53,MATCH(S36,master!$A$2:$A$53,0),3)=0,\"\",INDEX(master!$A$2:$C$53,MATCH(S36,master!$A$2:$A$53,0),3))","v":"リトルロジャース"},43]
[{"$nulls":6},0,{"$nulls":9},2]
[null,18,{"$f":"IF(INDEX(master!$A$2:$C$53,MATCH(E38,master!$A$2:$A$53,0),3)=0,\"\",INDEX(master!$A$2:$C$53,MATCH(E38,master!$A$2:$A$53,0),3))","v":"リトルジャイアンツ"},{"$f":"INDEX(master!$A$2:$C$53,MATCH(E38,master!$A$2:$A$53,0),2)","v":"E4位"},44,{"$nulls":13},42,{"$f":"INDEX(master!$A$2:$C$53,MATCH(S38,master!$A$2:$A$53,0),2)","v":"C4位"},{"$f":"IF(INDEX(master!$A$2:$C$53,MATCH(S38,master!$A$2:$A$53,0),3)=0,\"\",INDEX(master!$A$2:$C$53,MATCH(S38,master!$A$2:$A$53,0),3))","v":"品川ドリームキッズ"},44]
[{"$nulls":5},3,{"$nulls":11},2]
[null,19,{"$f":"IF(INDEX(master!$A$2:$C$53,MATCH(E40,master!$A$2:$A$53,0),3)=0,\"\",INDEX(master!$A$2:$C$53,MATCH(E40,master!$A$2:$A$53,0),3))","v":"深川ジャイアンツ"},{"$f":"INDEX(master!$A$2:$C$53,MATCH(E40,master!$A$2:$A$53,0),2)","v":"L1位"},12,null,null,12,{"$nulls":7},"2(1)",null,null,7,{"$f":"INDEX(master!$A$2:$C$53,MATCH(S40,master!$A$2:$A$53,0),2)","v":"G1位"},{"$f":"IF(INDEX(master!$A$2:$C$53,MATCH(S40,master!$A$2:$A$53,0),3)=0,\"\",INDEX(master!$A$2:$C$53,MATCH(S40,master!$A$2:$A$53,0),3))","v":"レッドサンズ"},45]
[{"$nulls":6},19,{"$nulls":9},1]
[null,20,{"$f":"IF(INDEX(master!$A$2:$C$53,MATCH(E42,master!$A$2:$A$53,0),3)=0,\"\",INDEX(master!$A$2:$C$53,MATCH(E42,master!$A$2:$A$53,0),3))","v":"葛西ファイターズ"},{"$f":"INDEX(master!$A$2:$C$53,MATCH(E42,master!$A$2:$A$53,0),2)","v":"M1位"},13,15,null,null,null,9,null,null,null,0,null,null,null,9,15,{"$f":"INDEX(master!$A$2:$C$53,MATCH(S42,master!$A$2:$A$53,0),2)","v":"B2位"},{"$f":"IF(INDEX(master!$A$2:$C$53,MATCH(S42,master!$A$2:$A$53,0),3)=0,\"\",INDEX(master!$A$2:$C$53,MATCH(S42,master!$A$2:$A$53,0),3))","v":"大雲寺スターズ"},46]
[{"$nulls":6},13,{"$nulls":9},1]
[null,21,{"$f":"IF(INDEX(master!$A$2:$C$53,MATCH(E44,master!$A$2:$A$53,0),3)=0,\"\",INDEX(master!$A$2:$C$53,MATCH(E44,master!$A$2:$A$53,0),3))","v":"高輪台ファイターズ"},{"$f":"INDEX(master!$A$2:$C$53,MATCH(E44,master!$A$2:$A$53,0),2)","v":"L4位"},51,8,{"$nulls":12},50,{"$f":"INDEX(master!$A$2:$C$53,MATCH(S44,master!$A$2:$A$53,0),2)","v":"K4位"},{"$f":"IF(INDEX(master!$A$2:$C$53,MATCH(S44,master!$A$2:$A$53,0),3)=0,\"\",INDEX(master!$A$2:$C$53,MATCH(S44,master!$A$2:$A$53,0),3))","v":"オール麻布"},47]
[{"$nulls":7},4,{"$nulls":7},1,null,8]
[null,22,{"$f":"IF(INDEX(master!$A$2:$C$53,MATCH(E46,master!$A$2:$A$53,0),3)=0,\"\",INDEX(master!$A$2:$C$53,MATCH(E46,master!$A$2:$A$53,0),3))","v":"落一アポロ"},{"$f":"INDEX(master!$A$2:$C$53,MATCH(E46,master!$A$2:$A$53,0),2)","v":"F4位"},45,2,{"$nulls":11},5,47,{"$f":"INDEX(master!$A$2:$C$53,MATCH(S46,master!$A$2:$A$53,0),2)","v":"H4位"},{"$f":"IF(INDEX(master!$A$2:$C$53,MATCH(S46,master!$A$2:$A$53,0),3)=0,\"\",INDEX(master!$A$2:$C$53,MATCH(S46,master!$A$2:$A$53,0),3))","v":"中央フェニックス"},48]
[]
[null,23,{"$f":"IF(INDEX(master!$A$2:$C$53,MATCH(E48,master!$A$2:$A$53,0),3)=0,\"\",INDEX(master!$A$2:$C$53,MATCH(E48,master!$A$2:$A$53,0),3))","v":"城北メッツ"},{"$f":"INDEX(master!$A$2:$C$53,MATCH(E48,master!$A$2:$A$53,0),2)","v":"G2位"},20,null,8,{"$nulls":9},7,null,18,{"$f":"INDEX(master!$A$2:$C$53,MATCH(S48,master!$A$2:$A$53,0),2)","v":"E2位"},{"$f":"IF(INDEX(master!$A$2:$C$53,MATCH(S48,master!$A$2:$A$53,0),3)=0,\"\",INDEX(master!$A$2:$C$53,MATCH(S48,master!$A$2:$A$53,0),3))","v":"カバラホークス"},49]
[{"$nulls":5},7,{"$nulls":11},3]
[null,24,{"$f":"IF(INDEX(master!$A$2:$C$53,MATCH(E50,master!$A$2:$A$53,0),3)=0,\"\",INDEX(master!$A$2:$C$53,MATCH(E50,master!$A$2:$A$53,0),3))","v":"金町ジャイアンツ"},{"$f":"INDEX(master!$A$2:$C$53,MATCH(E50,master!$A$2:$A$53,0),2)","v":"C3位"},29,8,null,null,7,{"$nulls":5},6,null,null,0,31,{"$f":"INDEX(master!$A$2:$C$53,MATCH(S50,master!$A$2:$A$53,0),2)","v":"E3位"},{"$f":"IF(INDEX(master!$A$2:$C$53,MATCH(S50,master!$A$2:$A$53,0),3)=0,\"\",INDEX(master!$A$2:$C$53,MATCH(S50,master!$A$2:$A$53,0),3))","v":"西千タイガース"},50]
[{"$nulls":6},1,{"$nulls":9},4]
[null,25,{"$f":"IF(INDEX(master!$A$2:$C$53,MATCH(E52,master!$A$2:$A$53,0),3)=0,\"\",INDEX(master!$A$2:$C$53,MATCH(E52,master!$A$2:$A$53,0),3))","v":"高井戸東少年野球"},{"$f":"INDEX(master!$A$2:$C$53,MATCH(E52,master!$A$2:$A$53,0),2)","v":"J3位"},36,{"$nulls":13},34,{"$f":"INDEX(master!$A$2:$C$53,MATCH(S52,master!$A$2:$A$53,0),2)","v":"H3位"},{"$f":"IF(INDEX(master!$A$2:$C$53,MATCH(S52,master!$A$2:$A$53,0),3)=0,\"\",INDEX(master!$A$2:$C$53,MATCH(S52,master!$A$2:$A$53,0),3))","v":"東陽フェニックス"},51]
[{"$nulls":5},13,{"$nulls":11},8]
[null,26,{"$f":"IF(INDEX(master!$A$2:$C$53,MATCH(E54,master!$A$2:$A$53,0),3)=0,\"\",INDEX(master!$A$2:$C$53,MATCH(E54,master!$A$2:$A$53,0),3))","v":"西田野球クラブ"},{"$f":"INDEX(master!$A$2:$C$53,MATCH(E54,master!$A$2:$A$53,0),2)","v":"D1位"},4,null,null,2,{"$nulls":7},0,null,null,2,{"$f":"INDEX(master!$A$2:$C$53,MATCH(S54,master!$A$2:$A$53,0),2)","v":"B1位"},{"$f":"IF(INDEX(master!$A$2:$C$53,MATCH(S54,master!$A$2:$A$53,0),3)=0,\"\",INDEX(master!$A$2:$C$53,MATCH(S54,master!$A$2:$A$53,0),3))","v":"中央バンディーズ"},52]
[{"$nulls":6},3,{"$nulls":9},1]

{"sheet":"チャレンジトーナメント","index":1,"n_rows":55,"n_cols":22,"rows_kept":55,"cut":false,"hidden":false,"merged":[[0,1,0,21],[3,1,4,1],[3,2,4,2],[3,3,4,3],[3,4,4,4],[3,18,4,18],[3,19,4,19],[3,20,4,20],[3,21,4,21],[5,20,6,20],[5,21,6,21],[7,1,8,1],[7,2,8,2],[7,3,8,3],[7,4,8,4],[7,18,8,18],[7,19,8,19],[7,20,8,20],[7,21,8,21],[5,1,6,1],[5,2,6,2],[5,3,6,3],[5,4,6,4],[5,18,6,18],[5,19,6,19],[9,20,10,20],[9,21,10,21],[11,1,12,1],[11,2,12,2],[11,3,12,3],[11,4,12,4],[11,18,12,18],[11,19,12,19],[11,20,12,20],[11,21,12,21],[9,1,10,1],[9,2,10,2],[9,3,10,3],[9,4,10,4],[9,18,10,18],[9,19,10,19],[13,20,14,20],[13,21,14,21],[15,1,16,1],[15,2,16,2],[15,3,16,3],[15,4,16,4],[15,18,16,18],[15,19,16,19],[15,20,16,20],[15,21,16,21],[13,1,14,1],[13,2,14,2],[13,3,14,3],[13,4,14,4],[13,18,14,18],[13,19,14,19],[17,20,18,20],[17,21,18,21],[19,1,20,1],[19,2,20,2],[19,3,20,3],[19,4,20,4],[19,18,20,18],[19,19,20,19],[19,20,20,20],[19,21,20,21],[17,1,18,1],[17,2,18,2],[17,3,18,3],[17,4,18,4],[17,18,18,18],[17,19,18,19],[21,20,22,20],[21,21,22,21],[23,1,24,1],[23,2,24,2],[23,3,24,3],[23,4,24,4],[23,18,24,18],[23,19,24,19],[23,20,24,20],[23,21,24,21],[21,1,22,1],[21,2,22,2],[21,3,22,3],[21,4,22,4],[21,18,22,18],[21,19,22,19],[25,20,26,20],[25,21,26,21],[27,1,28,1],[27,2,28,2],[27,3,28,3],[27,4,28,4],[27,18,28,18],[27,19,28,19],[27,20,28,20],[27,21,28,21],[25,1,26,1],[25,2,26,2],[25,3,26,3],[25,4,26,4],[25,18,26,18],[25,19,26,19],[29,19,30,19],[29,20,30,20],[29,21,30,21],[31,1,32,1],[31,2,32,2],[31,3,32,3],[31,4,32,4],[31,18,32,18],[31,19,32,19],[31,20,32,20],[28,11,29,11],[29,1,30,1],[29,2,30,2],[29,3,30,3],[29,4,30,4],[29,18,30,18],[31,21,32,21],[33,1,34,1],[33,2,34,2],[33,3,34,3],[33,4,34,4],[33,18,34,18],[33,19,34,19],[33,20,34,20],[33,21,34,21],[35,20,36,20],[35,21,36,21],[37,1,38,1],[37,2,38,2],[37,3,38,3],[37,4,38,4],[37,18,38,18],[37,19,38,19],[37,20,38,20],[37,21,38,21],[35,1,36,1],[35,2,36,2],[35,3,36,3],[35,4,36,4],[35,18,36,18],[35,19,36,19],[39,20,40,20],[39,21,40,21],[41,1,42,1],[41,2,42,2],[41,3,42,3],[41,4,42,4],[41,18,42,18],[41,19,42,19],[41,20,42,20],[41,21,42,21],[39,1,40,1],[39,2,40,2],[39,3,40,3],[39,4,40,4],[39,18,40,18],[39,19,40,19],[43,20,44,20],[43,21,44,21],[45,1,46,1],[45,2,46,2],[45,3,46,3],[45,4,46,4],[45,18,46,18],[45,19,46,19],[45,20,46,20],[45,21,46,21],[43,1,44,1],[43,2,44,2],[43,3,44,3],[43,4,44,4],[43,18,44,18],[43,19,44,19],[47,20,48,20],[47,21,48,21],[49,1,50,1],[49,2,50,2],[49,3,50,3],[49,4,50,4],[49,18,50,18],[49,19,50,19],[49,20,50,20],[49,21,50,21],[47,1,48,1],[47,2,48,2],[47,3,48,3],[47,4,48,4],[47,18,48,18],[47,19,48,19],[51,20,52,20],[51,21,52,21],[53,1,54,1],[53,2,54,2],[53,3,54,3],[53,4,54,4],[53,18,54,18],[53,19,54,19],[53,20,54,20],[53,21,54,21],[51,1,52,1],[51,2,52,2],[51,3,52,3],[51,4,52,4],[51,18,52,18],[51,19,52,19]]}
[null,"第１６回　スーパーリ－グチャレンジトーナメント表"]
[]
[]
[null,1,{"$f":"IF(INDEX(master!$E$2:$G$53,MATCH(E4,master!$E$2:$E$53,0),3)=0,\"\",INDEX(master!$E$2:$G$53,MATCH(E4,master!$E$2:$E$53,0),3))","v":"ナインスターズ"},{"$f":"INDEX(master!$E$2:$G$53,MATCH(E4,master!$E$2:$E$53,0),2)","v":"M5位"},1,null,8,{"$nulls":9},8,null,3,{"$f":"INDEX(master!$E$2:$G$53,MATCH(S4,master!$E$2:$E$53,0),2)","v":"K5位"},{"$f":"IF(INDEX(master!$E$2:$G$53,MATCH(S4,master!$E$2:$E$53,0),3)=0,\"\",INDEX(master!$E$2:$G$53,MATCH(S4,master!$E$2:$E$53,0),3))","v":"いちがやチーターズ"},27]
[{"$nulls":7},7,{"$nulls":7},10]
[null,2,{"$f":"IF(INDEX(master!$E$2:$G$53,MATCH(E6,master!$E$2:$E$53,0),3)=0,\"\",INDEX(master!$E$2:$G$53,MATCH(E6,master!$E$2:$E$53,0),3))","v":"大塚スネイクス"},{"$f":"INDEX(master!$E$2:$G$53,MATCH(E6,master!$E$2:$E$53,0),2)","v":"G7位"},33,2,{"$nulls":11},2,35,{"$f":"INDEX(master!$E$2:$G$53,MATCH(S6,master!$E$2:$E$53,0),2)","v":"E7位"},{"$f":"IF(INDEX(master!$E$2:$G$53,MATCH(S6,master!$E$2:$E$53,0),3)=0,\"\",INDEX(master!$E$2:$G$53,MATCH(S6,master!$E$2:$E$53,0),3))","v":"浅草BBC"},28]
[]
[null,3,{"$f":"IF(INDEX(master!$E$2:$G$53,MATCH(E8,master!$E$2:$E$53,0),3)=0,\"\",INDEX(master!$E$2:$G$53,MATCH(E8,master!$E$2:$E$53,0),3))","v":"南千住ペガサス"},{"$f":"INDEX(master!$E$2:$G$53,MATCH(E8,master!$E$2:$E$53,0),2)","v":"H7位"},32,null,1,{"$nulls":9},3,null,30,{"$f":"INDEX(master!$E$2:$G$53,MATCH(S8,master!$E$2:$E$53,0),2)","v":"J7位"},{"$f":"IF(INDEX(master!$E$2:$G$53,MATCH(S8,master!$E$2:$E$53,0),3)=0,\"\",INDEX(master!$E$2:$G$53,MATCH(S8,master!$E$2:$E$53,0),3))","v":"元芝ハヤブサ"},29]
[{"$nulls":5},3,null,null,5,{"$nulls":5},14,null,null,11]
[null,4,{"$f":"IF(INDEX(master!$E$2:$G$53,MATCH(E10,master!$E$2:$E$53,0),3)=0,\"\",INDEX(master!$E$2:$G$53,MATCH(E10,master!$E$2:$E$53,0),3))","v":"ブルースカイズ"},{"$f":"INDEX(master!$E$2:$G$53,MATCH(E10,master!$E$2:$E$53,0),2)","v":"J6位"},17,16,{"$nulls":11},20,19,{"$f":"INDEX(master!$E$2:$G$53,MATCH(S10,master!$E$2:$E$53,0),2)","v":"H6位"},{"$f":"IF(INDEX(master!$E$2:$G$53,MATCH(S10,master!$E$2:$E$53,0),3)=0,\"\",INDEX(master!$E$2:$G$53,MATCH(S10,master!$E$2:$E$53,0),3))","v":"九品仏ペガサス"},30]
[{"$nulls":6},9,{"$nulls":9},3]
[null,5,{"$f":"IF(INDEX(master!$E$2:$G$53,MATCH(E12,master!$E$2:$E$53,0),3)=0,\"\",INDEX(master!$E$2:$G$53,MATCH(E12,master!$E$2:$E$53,0),3))","v":"フレール"},{"$f":"INDEX(master!$E$2:$G$53,MATCH(E12,master!$E$2:$E$53,0),2)","v":"E8位"},48,{"$nulls":13},46,{"$f":"INDEX(master!$E$2:$G$53,MATCH(S12,master!$E$2:$E$53,0),2)","v":"G8位"},{"$f":"IF(INDEX(master!$E$2:$G$53,MATCH(S12,master!$E$2:$E$53,0),3)=0,\"\",INDEX(master!$E$2:$G$53,MATCH(S12,master!$E$2:$E$53,0),3))","v":"江東ジョーズ"},31]
[{"$nulls":5},0,{"$nulls":11},3]
[null,6,{"$f":"IF(INDEX(master!$E$2:$G$53,MATCH(E14,master!$E$2:$E$53,0),3)=0,\"\",INDEX(master!$E$2:$G$53,MATCH(E14,master!$E$2:$E$53,0),3))","v":"麻布キッズ"},{"$f":"INDEX(master!$E$2:$G$53,MATCH(E14,master!$E$2:$E$53,0),2)","v":"D8位"},49,6,null,6,{"$nulls":7},4,null,5,52,{"$f":"INDEX(master!$E$2:$G$53,MATCH(S14,master!$E$2:$E$53,0),2)","v":"A8位"},{"$f":"IF(INDEX(master!$E$2:$G$53,MATCH(S14,master!$E$2:$E$53,0),3)=0,\"\",INDEX(master!$E$2:$G$53,MATCH(S14,master!$E$2:$E$53,0),3))","v":"番町エンジェルス"},32]
[]
[null,7,{"$f":"IF(INDEX(master!$E$2:$G$53,MATCH(E16,master!$E$2:$E$53,0),3)=0,\"\",INDEX(master!$E$2:$G$53,MATCH(E16,master!$E$2:$E$53,0),3))","v":"東伊興シャインズ"},{"$f":"INDEX(master!$E$2:$G$53,MATCH(E16,master!$E$2:$E$53,0),2)","v":"K6位"},16,null,2,{"$nulls":9},4,null,14,{"$f":"INDEX(master!$E$2:$G$53,MATCH(S16,master!$E$2:$E$53,0),2)","v":"M6位"},{"$f":"IF(INDEX(master!$E$2:$G$53,MATCH(S16,master!$E$2:$E$53,0),3)=0,\"\",INDEX(master!$E$2:$G$53,MATCH(S16,master!$E$2:$E$53,0),3))","v":"ゼットタイガー"},33]
[{"$nulls":5},8,null,null,null,3,null,null,null,0,null,null,null,7]
[null,8,{"$f":"IF(INDEX(master!$E$2:$G$53,MATCH(E18,master!$E$2:$E$53,0),3)=0,\"\",INDEX(master!$E$2:$G$53,MATCH(E18,master!$E$2:$E$53,0),3))","v":"日本橋ファイターズ"},{"$f":"INDEX(master!$E$2:$G$53,MATCH(E18,master!$E$2:$E$53,0),2)","v":"E5位"},9,null,6,{"$nulls":9},14,null,11,{"$f":"INDEX(master!$E$2:$G$53,MATCH(S18,master!$E$2:$E$53,0),2)","v":"C5位"},{"$f":"IF(INDEX(master!$E$2:$G$53,MATCH(S18,master!$E$2:$E$53,0),3)=0,\"\",INDEX(master!$E$2:$G$53,MATCH(S18,master!$E$2:$E$53,0),3))","v":"桃五少年野球クラブ"},34]
[{"$nulls":7},4,{"$nulls":7},6]
[null,9,{"$f":"IF(INDEX(master!$E$2:$G$53,MATCH(E20,master!$E$2:$E$53,0),3)=0,\"\",INDEX(master!$E$2:$G$53,MATCH(E20,master!$E$2:$E$53,0),3))","v":"本一色イーグルス"},{"$f":"INDEX(master!$E$2:$G$53,MATCH(E20,master!$E$2:$E$53,0),2)","v":"L8位"},41,7,{"$nulls":11},0,43,{"$f":"INDEX(master!$E$2:$G$53,MATCH(S20,master!$E$2:$E$53,0),2)","v":"J8位"},{"$f":"IF(INDEX(master!$E$2:$G$53,MATCH(S20,master!$E$2:$E$53,0),3)=0,\"\",INDEX(master!$E$2:$G$53,MATCH(S20,master!$E$2:$E$53,0),3))","v":"亀戸合同"},35]
[]
[null,10,{"$f":"IF(INDEX(master!$E$2:$G$53,MATCH(E22,master!$E$2:$E$53,0),3)=0,\"\",INDEX(master!$E$2:$G$53,MATCH(E22,master!$E$2:$E$53,0),3))","v":"勝どきDNH"},{"$f":"INDEX(master!$E$2:$G$53,MATCH(E22,master!$E$2:$E$53,0),2)","v":"C6位"},24,null,3,{"$nulls":9},2,null,22,{"$f":"INDEX(master!$E$2:$G$53,MATCH(S22,master!$E$2:$E$53,0),2)","v":"E6位"},{"$f":"IF(INDEX(master!$E$2:$G$53,MATCH(S22,master!$E$2:$E$53,0),3)=0,\"\",INDEX(master!$E$2:$G$53,MATCH(S22,master!$E$2:$E$53,0),3))","v":"エンジェルス"},36]
[{"$nulls":5},4,{"$nulls":11},6]
[null,11,{"$f":"IF(INDEX(master!$E$2:$G$53,MATCH(E24,master!$E$2:$E$53,0),3)=0,\"\",INDEX(master!$E$2:$G$53,MATCH(E24,master!$E$2:$E$53,0),3))","v":"大島タイガース"},{"$f":"INDEX(master!$E$2:$G$53,MATCH(E24,master!$E$2:$E$53,0),2)","v":"B6位"},25,8,null,null,6,{"$nulls":5},5,null,null,5,27,{"$f":"INDEX(master!$E$2:$G$53,MATCH(S24,master!$E$2:$E$53,0),2)","v":"M7位"},{"$f":"IF(INDEX(master!$E$2:$G$53,MATCH(S24,master!$E$2:$E$53,0),3)=0,\"\",INDEX(master!$E$2:$G$53,MATCH(S24,master!$E$2:$E$53,0),3))","v":"深川レッドソックス"},37]
[{"$nulls":6},1,{"$nulls":9},0]
[null,12,{"$f":"IF(INDEX(master!$E$2:$G$53,MATCH(E26,master!$E$2:$E$53,0),3)=0,\"\",INDEX(master!$E$2:$G$53,MATCH(E26,master!$E$2:$E$53,0),3))","v":"月島ライオンズ"},{"$f":"INDEX(master!$E$2:$G$53,MATCH(E26,master!$E$2:$E$53,0),2)","v":"M8位"},40,{"$nulls":13},39,{"$f":"INDEX(master!$E$2:$G$53,MATCH(S26,master!$E$2:$E$53,0),2)","v":"A7位"},{"$f":"IF(INDEX(master!$E$2:$G$53,MATCH(S26,master!$E$2:$E$53,0),3)=0,\"\",INDEX(master!$E$2:$G$53,MATCH(S26,master!$E$2:$E$53,0),3))","v":"駒込チャイルド"},38]
[{"$nulls":5},6,{"$nulls":11},4]
[null,13,{"$f":"IF(INDEX(master!$E$2:$G$53,MATCH(E28,master!$E$2:$E$53,0),3)=0,\"\",INDEX(master!$E$2:$G$53,MATCH(E28,master!$E$2:$E$53,0),3))","v":"久我山イーグルス"},{"$f":"INDEX(master!$E$2:$G$53,MATCH(E28,master!$E$2:$E$53,0),2)","v":"F5位"},8,null,null,10,null,null,null,"│",null,null,null,4,null,null,6,{"$f":"INDEX(master!$E$2:$G$53,MATCH(S28,master!$E$2:$E$53,0),2)","v":"H5位"},{"$f":"IF(INDEX(master!$E$2:$G$53,MATCH(S28,master!$E$2:$E$53,0),3)=0,\"\",INDEX(master!$E$2:$G$53,MATCH(S28,master!$E$2:$E$53,0),3))","v":"駒込ベアーズ"},39]
[{"$nulls":6},9,null,null,null,2,"Final",8,null,null,null,13]
[null,14,{"$f":"IF(INDEX(master!$E$2:$G$53,MATCH(E30,master!$E$2:$E$53,0),3)=0,\"\",INDEX(master!$E$2:$G$53,MATCH(E30,master!$E$2:$E$53,0),3))","v":"興宮ファイターズ"},{"$f":"INDEX(master!$E$2:$G$53,MATCH(E30,master!$E$2:$E$53,0),2)","v":"I5位"},5,null,7,{"$nulls":9},"10(5)",null,10,{"$f":"INDEX(master!$E$2:$G$53,MATCH(S30,master!$E$2:$E$53,0),2)","v":"D5位"},{"$f":"IF(INDEX(master!$E$2:$G$53,MATCH(S30,master!$E$2:$E$53,0),3)=0,\"\",INDEX(master!$E$2:$G$53,MATCH(S30,master!$E$2:$E$53,0),3))","v":"文京パワーズ"},40]
[{"$nulls":7},0,{"$nulls":7},4]
[null,15,{"$f":"IF(INDEX(master!$E$2:$G$53,MATCH(E32,master!$E$2:$E$53,0),3)=0,\"\",INDEX(master!$E$2:$G$53,MATCH(E32,master!$E$2:$E$53,0),3))","v":"糀谷イーグルス"},{"$f":"INDEX(master!$E$2:$G$53,MATCH(E32,master!$E$2:$E$53,0),2)","v":"C7位"},37,6,{"$nulls":11},6,38,{"$f":"INDEX(master!$E$2:$G$53,MATCH(S32,master!$E$2:$E$53,0),2)","v":"B7位"},{"$f":"IF(INDEX(master!$E$2:$G$53,MATCH(S32,master!$E$2:$E$53,0),3)=0,\"\",INDEX(master!$E$2:$G$53,MATCH(S32,master!$E$2:$E$53,0),3))","v":"渋谷レッドソックス"},41]
[]
[null,16,{"$f":"IF(INDEX(master!$E$2:$G$53,MATCH(E34,master!$E$2:$E$53,0),3)=0,\"\",INDEX(master!$E$2:$G$53,MATCH(E34,master!$E$2:$E$53,0),3))","v":"馬込ジャガース"},{"$f":"INDEX(master!$E$2:$G$53,MATCH(E34,master!$E$2:$E$53,0),2)","v":"L7位"},28,null,2,{"$nulls":9},"10(4)",null,26,{"$f":"INDEX(master!$E$2:$G$53,MATCH(S34,master!$E$2:$E$53,0),2)","v":"A6位"},{"$f":"IF(INDEX(master!$E$2:$G$53,MATCH(S34,master!$E$2:$E$53,0),3)=0,\"\",INDEX(master!$E$2:$G$53,MATCH(S34,master!$E$2:$E$53,0),3))","v":"マッハブレーブス"},42]
[{"$nulls":5},7,null,null,3,{"$nulls":5},2,null,null,14]
[null,17,{"$f":"IF(INDEX(master!$E$2:$G$53,MATCH(E36,master!$E$2:$E$53,0),3)=0,\"\",INDEX(master!$E$2:$G$53,MATCH(E36,master!$E$2:$E$53,0),3))","v":"南篠崎ランチャーズ"},{"$f":"INDEX(master!$E$2:$G$53,MATCH(E36,master!$E$2:$E$53,0),2)","v":"F6位"},21,0,{"$nulls":11},6,23,{"$f":"INDEX(master!$E$2:$G$53,MATCH(S36,master!$E$2:$E$53,0),2)","v":"D6位"},{"$f":"IF(INDEX(master!$E$2:$G$53,MATCH(S36,master!$E$2:$E$53,0),3)=0,\"\",INDEX(master!$E$2:$G$53,MATCH(S36,master!$E$2:$E$53,0),3))","v":"トゥールスジュニア"},43]
[{"$nulls":6},"5(4)",{"$nulls":9},0]
[null,18,{"$f":"IF(INDEX(master!$E$2:$G$53,MATCH(E38,master!$E$2:$E$53,0),3)=0,\"\",INDEX(master!$E$2:$G$53,MATCH(E38,master!$E$2:$E$53,0),3))","v":"東山エイターズ"},{"$f":"INDEX(master!$E$2:$G$53,MATCH(E38,master!$E$2:$E$53,0),2)","v":"I8位"},44,{"$nulls":13},42,{"$f":"INDEX(master!$E$2:$G$53,MATCH(S38,master!$E$2:$E$53,0),2)","v":"K8位"},{"$f":"IF(INDEX(master!$E$2:$G$53,MATCH(S38,master!$E$2:$E$53,0),3)=0,\"\",INDEX(master!$E$2:$G$53,MATCH(S38,master!$E$2:$E$53,0),3))","v":"荒川コンドル"},44]
[{"$nulls":5},1,{"$nulls":11},4]
[null,19,{"$f":"IF(INDEX(master!$E$2:$G$53,MATCH(E40,master!$E$2:$E$53,0),3)=0,\"\",INDEX(master!$E$2:$G$53,MATCH(E40,master!$E$2:$E$53,0),3))","v":"烏山ウイングス"},{"$f":"INDEX(master!$E$2:$G$53,MATCH(E40,master!$E$2:$E$53,0),2)","v":"B5位"},12,null,null,7,{"$nulls":7},3,null,null,7,{"$f":"INDEX(master!$E$2:$G$53,MATCH(S40,master!$E$2:$E$53,0),2)","v":"G5位"},{"$f":"IF(INDEX(master!$E$2:$G$53,MATCH(S40,master!$E$2:$E$53,0),3)=0,\"\",INDEX(master!$E$2:$G$53,MATCH(S40,master!$E$2:$E$53,0),3))","v":"球友ジュニアーズ"},45]
[{"$nulls":6},"5(5)",{"$nulls":9},8]
[null,20,{"$f":"IF(INDEX(master!$E$2:$G$53,MATCH(E42,master!$E$2:$E$53,0),3)=0,\"\",INDEX(master!$E$2:$G$53,MATCH(E42,master!$E$2:$E$53,0),3))","v":"墨田スターズ"},{"$f":"INDEX(master!$E$2:$G$53,MATCH(E42,master!$E$2:$E$53,0),2)","v":"A5位"},13,4,null,null,null,1,null,null,null,3,null,null,null,3,15,{"$f":"INDEX(master!$E$2:$G$53,MATCH(S42,master!$E$2:$E$53,0),2)","v":"L6位"},{"$f":"IF(INDEX(master!$E$2:$G$53,MATCH(S42,master!$E$2:$E$53,0),3)=0,\"\",INDEX(master!$E$2:$G$53,MATCH(S42,master!$E$2:$E$53,0),3))","v":"有馬スワローズ"},46]
[{"$nulls":6},7,{"$nulls":9},1]
[null,21,{"$f":"IF(INDEX(master!$E$2:$G$53,MATCH(E44,master!$E$2:$E$53,0),3)=0,\"\",INDEX(master!$E$2:$G$53,MATCH(E44,master!$E$2:$E$53,0),3))","v":"ブラックキラーズ"},{"$f":"INDEX(master!$E$2:$G$53,MATCH(E44,master!$E$2:$E$53,0),2)","v":"B8位"},51,{"$nulls":13},50,{"$f":"INDEX(master!$E$2:$G$53,MATCH(S44,master!$E$2:$E$53,0),2)","v":"C8位"},{"$f":"IF(INDEX(master!$E$2:$G$53,MATCH(S44,master!$E$2:$E$53,0),3)=0,\"\",INDEX(master!$E$2:$G$53,MATCH(S44,master!$E$2:$E$53,0),3))","v":"麹町ドリームス"},47]
[{"$nulls":5},1,null,0,{"$nulls":7},12,null,5]
[null,22,{"$f":"IF(INDEX(master!$E$2:$G$53,MATCH(E46,master!$E$2:$E$53,0),3)=0,\"\",INDEX(master!$E$2:$G$53,MATCH(E46,master!$E$2:$E$53,0),3))","v":"ジャパンキングス"},{"$f":"INDEX(master!$E$2:$G$53,MATCH(E46,master!$E$2:$E$53,0),2)","v":"H8位"},45,2,{"$nulls":11},0,47,{"$f":"INDEX(master!$E$2:$G$53,MATCH(S46,master!$E$2:$E$53,0),2)","v":"F8位"},{"$f":"IF(INDEX(master!$E$2:$G$53,MATCH(S46,master!$E$2:$E$53,0),3)=0,\"\",INDEX(master!$E$2:$G$53,MATCH(S46,master!$E$2:$E$53,0),3))","v":"江東ファイターズ"},48]
[]
[null,23,{"$f":"IF(INDEX(master!$E$2:$G$53,MATCH(E48,master!$E$2:$E$53,0),3)=0,\"\",INDEX(master!$E$2:$G$53,MATCH(E48,master!$E$2:$E$53,0),3))","v":"KCRジャッカル"},{"$f":"INDEX(master!$E$2:$G$53,MATCH(E48,master!$E$2:$E$53,0),2)","v":"G6位"},20,null,9,{"$nulls":9},11,null,18,{"$f":"INDEX(master!$E$2:$G$53,MATCH(S48,master!$E$2:$E$53,0),2)","v":"I6位"},{"$f":"IF(INDEX(master!$E$2:$G$53,MATCH(S48,master!$E$2:$E$53,0),3)=0,\"\",INDEX(master!$E$2:$G$53,MATCH(S48,master!$E$2:$E$53,0),3))","v":"レッドファイヤーズ"},49]
[{"$nulls":5},3,{"$nulls":11},16]
[null,24,{"$f":"IF(INDEX(master!$E$2:$G$53,MATCH(E50,master!$E$2:$E$53,0),3)=0,\"\",INDEX(master!$E$2:$G$53,MATCH(E50,master!$E$2:$E$53,0),3))","v":"ニュー愛宕"},{"$f":"INDEX(master!$E$2:$G$53,MATCH(E50,master!$E$2:$E$53,0),2)","v":"K7位"},29,9,null,null,6,{"$nulls":5},18,null,null,8,31,{"$f":"INDEX(master!$E$2:$G$53,MATCH(S50,master!$E$2:$E$53,0),2)","v":"I7位"},{"$f":"IF(INDEX(master!$E$2:$G$53,MATCH(S50,master!$E$2:$E$53,0),3)=0,\"\",INDEX(master!$E$2:$G$53,MATCH(S50,master!$E$2:$E$53,0),3))","v":"礫川"},50]
[{"$nulls":6},0,{"$nulls":9},10]
[null,25,{"$f":"IF(INDEX(master!$E$2:$G$53,MATCH(E52,master!$E$2:$E$53,0),3)=0,\"\",INDEX(master!$E$2:$G$53,MATCH(E52,master!$E$2:$E$53,0),3))","v":"落合コメッツ"},{"$f":"INDEX(master!$E$2:$G$53,MATCH(E52,master!$E$2:$E$53,0),2)","v":"D7位"},36,{"$nulls":13},34,{"$f":"INDEX(master!$E$2:$G$53,MATCH(S52,master!$E$2:$E$53,0),2)","v":"F7位"},{"$f":"IF(INDEX(master!$E$2:$G$53,MATCH(S52,master!$E$2:$E$53,0),3)=0,\"\",INDEX(master!$E$2:$G$53,MATCH(S52,master!$E$2:$E$53,0),3))","v":"港南メッツ"},51]
[{"$nulls":5},4,{"$nulls":11},7]
[null,26,{"$f":"IF(INDEX(master!$E$2:$G$53,MATCH(E54,master!$E$2:$E$53,0),3)=0,\"\",INDEX(master!$E$2:$G$53,MATCH(E54,master!$E$2:$E$53,0),3))","v":"雷サンダース"},{"$f":"INDEX(master!$E$2:$G$53,MATCH(E54,master!$E$2:$E$53,0),2)","v":"J5位"},4,null,null,12,{"$nulls":7},1,null,null,2,{"$f":"INDEX(master!$E$2:$G$53,MATCH(S54,master!$E$2:$E$53,0),2)","v":"L5位"},{"$f":"IF(INDEX(master!$E$2:$G$53,MATCH(S54,master!$E$2:$E$53,0),3)=0,\"\",INDEX(master!$E$2:$G$53,MATCH(S54,master!$E$2:$E$53,0),3))","v":"菊坂ファイヤーズ"},52]
[{"$nulls":6},13,{"$nulls":9},4]

{"sheet":"master","index":2,"n_rows":53,"n_cols":7,"rows_kept":53,"cut":false,"hidden":false,"merged":[]}
[]
[1,"A1位","本村クラブ",null,1,"M5位","ナインスターズ"]
[2,"B1位","中央バンディーズ",null,2,"L5位","菊坂ファイヤーズ"]
[3,"C1位","茗荷谷クラブ",null,3,"K5位","いちがやチーターズ"]
[4,"D1位","西田野球クラブ",null,4,"J5位","雷サンダース"]
[5,"E1位","七北クラブ",null,5,"I5位","興宮ファイターズ"]
[6,"F1位","山野Ｒイーグルス",null,6,"H5位","駒込ベアーズ"]
[7,"G1位","レッドサンズ",null,7,"G5位","球友ジュニアーズ"]
[8,"H1位","淀四ライオンズ",null,8,"F5位","久我山イーグルス"]
[9,"I1位","高島エイト",null,9,"E5位","日本橋ファイターズ"]
[10,"J1位","船橋フェニックス",null,10,"D5位","文京パワーズ"]
[11,"K1位","用賀ベアーズ",null,11,"C5位","桃五少年野球クラブ"]
[12,"L1位","深川ジャイアンツ",null,12,"B5位","烏山ウイングス"]
[13,"M1位","葛西ファイターズ",null,13,"A5位","墨田スターズ"]
[14,"A2位","大島中央",null,14,"M6位","ゼットタイガー"]
[15,"B2位","大雲寺スターズ",null,15,"L6位","有馬スワローズ"]
[16,"C2位","越中島ブレーブス",null,16,"K6位","東伊興シャインズ"]
[17,"D2位","東雲メッツ",null,17,"J6位","ブルースカイズ"]
[18,"E2位","カバラホークス",null,18,"I6位","レッドファイヤーズ"]
[19,"F2位","葛飾アニマルズ",null,19,"H6位","九品仏ペガサス"]
[20,"G2位","城北メッツ",null,20,"G6位","KCRジャッカル"]
[21,"H2位","池雪ジュニアS",null,21,"F6位","南篠崎ランチャーズ"]
[22,"I2位","高輪クラブ",null,22,"E6位","エンジェルス"]
[23,"J2位","リトルロジャース",null,23,"D6位","トゥールスジュニア"]
[24,"K2位","北原少年野球クラブ",null,24,"C6位","勝どきDNH"]
[25,"L2位","不動パイレーツ",null,25,"B6位","大島タイガース"]
[26,"M2位","サンジュニア",null,26,"A6位","マッハブレーブス"]
[27,"A3位","ブラザースクラブ",null,27,"M7位","深川レッドソックス"]
[28,"B3位","目黒ペガサス",null,28,"L7位","馬込ジャガース"]
[29,"C3位","金町ジャイアンツ",null,29,"K7位","ニュー愛宕"]
[30,"D3位","大向ベアーズ",null,30,"J7位","元芝ハヤブサ"]
[31,"E3位","西千タイガース",null,31,"I7位","礫川"]
[32,"F3位","扇ターキーズ",null,32,"H7位","南千住ペガサス"]
[33,"G3位","新宿ドリーム",null,33,"G7位","大塚スネイクス"]
[34,"H3位","東陽フェニックス",null,34,"F7位","港南メッツ"]
[35,"I3位","元加賀",null,35,"E7位","浅草BBC"]
[36,"J3位","高井戸東少年野球",null,36,"D7位","落合コメッツ"]
[37,"K3位","しらさぎ",null,37,"C7位","糀谷イーグルス"]
[38,"L3位","旗の台クラブ",null,38,"B7位","渋谷レッドソックス"]
[39,"M3位","品川Bレーシング",null,39,"A7位","駒込チャイルド"]
[40,"A4位","新田ファイヤーズ",null,40,"M8位","月島ライオンズ"]
[41,"B4位","御殿山ファイターズ",null,41,"L8位","本一色イーグルス"]
[42,"C4位","品川ドリームキッズ",null,42,"K8位","荒川コンドル"]
[43,"D4位","ジュニアヤンガース",null,43,"J8位","亀戸合同"]
[44,"E4位","リトルジャイアンツ",null,44,"I8位","東山エイターズ"]
[45,"F4位","落一アポロ",null,45,"H8位","ジャパンキングス"]
[46,"G4位","晴海アポローズ",null,46,"G8位","江東ジョーズ"]
[47,"H4位","中央フェニックス",null,47,"F8位","江東ファイターズ"]
[48,"I4位","品川レインボーズ",null,48,"E8位","フレール"]
[49,"J4位","西伊興若潮ジュニア",null,49,"D8位","麻布キッズ"]
[50,"K4位","オール麻布",null,50,"C8位","麹町ドリームス"]
[51,"L4位","高輪台ファイターズ",null,51,"B8位","ブラックキラーズ"]
[52,"M4位","舎人スポーツ少年団",null,52,"A8位","番町エンジェルス"]